Target
Coagulation factor XI
Ligand
BDBM406677
Substrate
Meas. Tech.
In Vitro Factor XIa Enzyme assay
IC50
4.20±n/a nM
Citation
 Imagawa, AKondo, TNishiyama, TCourtney, SYarnold, CIchihara, OFlanagan, S Substituted pyrrolidines as factor XIa inhibitors for the treatment thromboembolic diseases US Patent  US10336741 Publication Date 7/2/2019 
Target
Name:
Coagulation factor XI
Synonyms:
Coagulation factor XIa Coagulation factor XIa light chain FA11_HUMAN Factor XIa PTA | Plasma thromboplastin antecedent
Type:
Enzyme
Mol. Mass.:
70130.58
Organism:
Homo sapiens (Human)
Description:
P03951
Residue:
625
  
Inhibitor
Name:
BDBM406677
Synonyms:
US10336741, Example 96
Type:
Small organic molecule
Emp. Form.:
C29H41ClN6O5S
Mol. Mass.:
621.191
SMILES:
COC(=O)Nc1ccc(cc1)-c1[nH]c(nc1Cl)[C@@H]1C[C@@H](CN1C(=O)C1CC[C@H](CN)CC1)C1CCN(CC1)S(C)(=O)=O
: