Target
Prothrombin
Ligand
BDBM238268
Substrate
Meas. Tech.
In Vitro Factor Xa and Thrombin Enzyme assay
IC50
>100000±n/a nM
Citation
 Imagawa, AKondo, TNishiyama, TCourtney, SYarnold, CIchihara, OFlanagan, S Substituted pyrrolidines as factor XIa inhibitors for the treatment thromboembolic diseases US Patent  US10336741 Publication Date 7/2/2019 
Target
Name:
Prothrombin
Synonyms:
Activation peptide fragment 1 Coagulation factor II Prothrombin precursor Thrombin heavy chain | Thrombin light chain
Type:
Protein
Mol. Mass.:
70029.57
Organism:
Homo sapiens (Human)
Description:
P00734
Residue:
622
  
Inhibitor
Name:
BDBM238268
Synonyms:
US10336741, Example 98 US9394250, 98 | US9585881, Example 98
Type:
Small organic molecule
Emp. Form.:
C27H39N9O5S
Mol. Mass.:
601.721
SMILES:
COC(=O)Nc1ccc(cc1)-c1cnc([nH]1)[C@@H]1C[C@@H](CN1C(=O)C1CCN(CC1)C(N)=N)N1CCN(CC1)S(C)(=O)=O
: