Target
Coagulation factor XI
Ligand
BDBM247419
Substrate
Meas. Tech.
In Vitro Factor XIa Assay
Ki
0.200±n/a nM
Citation
 Dilger, AKCorte, JRDe Lucca, IFang, TYang, WWang, YPabbisetty, KBEwing, WRZhu, YWexler, RRPinto, DJOrwat, MJSmith, II, LM Pyrimidinones as factor XIa inhibitors US Patent  US10336754 Publication Date 7/2/2019 
Target
Name:
Coagulation factor XI
Synonyms:
Coagulation factor XIa Coagulation factor XIa light chain FA11_HUMAN Factor XIa PTA | Plasma thromboplastin antecedent
Type:
Enzyme
Mol. Mass.:
70130.58
Organism:
Homo sapiens (Human)
Description:
P03951
Residue:
625
  
Inhibitor
Name:
BDBM247419
Synonyms:
US10336754, Example 373 US9453018, 373
Type:
Small organic molecule
Emp. Form.:
C29H26ClN9O4
Mol. Mass.:
600.028
SMILES:
C[C@@H]1CCC[C@@H](c2cc(ccn2)-c2c(NC1=O)cnn2C)n1cnc(cc1=O)-c1cc(Cl)ccc1-n1cc(nn1)C(O)=O
: