Target
Tyrosine-protein kinase BTK
Ligand
BDBM406684
Substrate
Meas. Tech.
BTK Enzyme Activity Testing
IC50
<100±n/a nM
Citation
 Chen, XPang, Y Fused pyrazole derivatives, preparation method thereof, and use thereof in treatment of cancers, inflammation and immune diseases US Patent  US10336755 Publication Date 7/2/2019 
Target
Name:
Tyrosine-protein kinase BTK
Synonyms:
AGMX1 Agammaglobulinaemia tyrosine kinase B cell progenitor kinase BPK BTK_HUMAN Tyrosine Kinase BTK Tyrosine-protein kinase BTK (BTK)
Type:
Enzyme
Mol. Mass.:
76289.95
Organism:
Homo sapiens (Human)
Description:
Q06187
Residue:
659
  
Inhibitor
Name:
BDBM406684
Synonyms:
1-(4-(7-(4-(pyridin-2-oxy)phenyl)-1H-pyrazazo[3,4-c]pyridin-5-yl)piperidin-1-yl)prop-2-en-1-one | US10336755, Example 12
Type:
Small organic molecule
Emp. Form.:
C27H33N3O3
Mol. Mass.:
447.5692
SMILES:
CC(=O)Nc1c(C)cc(nc1-c1ccc(OC2CCCC2)cc1)C1CCN(CC1)C(=O)C=C
: