Target
Hsp90 co-chaperone Cdc37
Ligand
BDBM50180302
Substrate
Meas. Tech.
Binding to JNPL3 brain Hsp90
EC50
30.8±n/a nM
Citation
 Chiosis, GGreengard, PDou, FLuo, WHe, HZatorska, D Treatment of neurodegenerative diseases through inhibition of HSP90 US Patent  US10336757 Publication Date 7/2/2019 
Target
Name:
Hsp90 co-chaperone Cdc37
Synonyms:
CDC37 CDC37_HUMAN | Hsp90 co-chaperone
Type:
Molecular Chaperone
Mol. Mass.:
44453.72
Organism:
Homo sapiens (Human)
Description:
Q16543
Residue:
378
  
Inhibitor
Name:
BDBM50180302
Synonyms:
8-(6-iodo-benzo[1,3]dioxol-5-ylsulfanyl)-9-(3-isopropylamino-propyl)adenine 8-[(6-IODO-1,3-BENZODIOXOL-5-YL)THIO]-9-[3-(ISOPROPYLAMINO)PROPYL]-9H-PURIN-6-AMINE US10336757, Compound PU-H71 | US10676476, Example 9
Type:
Small organic molecule
Emp. Form.:
C18H21IN6O2S
Mol. Mass.:
512.368
SMILES:
CC(C)NCCCn1c(Sc2cc3OCOc3cc2I)nc2c(N)ncnc12
: