Target
Tyrosine-protein kinase JAK1
Ligand
BDBM246872
Substrate
Meas. Tech.
PI3K Enzyme Assay
IC50
<10±n/a nM
Citation
 Qiao, LWeng, LMeloni, DJia, ZWang, JZhou, J Salts and processes of preparing a PI3K inhibitor US Patent  US10336759 Publication Date 7/2/2019 
Target
Name:
Tyrosine-protein kinase JAK1
Synonyms:
JAK-1 JAK1A JAK1_HUMAN Janus kinase 1 (JAK1) | Janus kinase 1 JAK1
Type:
Protein
Mol. Mass.:
133293.73
Organism:
Homo sapiens (Human)
Description:
P23458
Residue:
1154
  
Inhibitor
Name:
BDBM246872
Synonyms:
US10053465, 11 US10125150, Example 11 US10479803, Example 11 US10675284, Example 11 US11130767, # 11 US11304949, Compound 11 US11406640, Comp. No. 11 US9732097, Example 11 | {trans-3-(4-{[4-[(3- hydroxyazetidin-1- yl)methyl]-6- (trifluoromethyl) pyridin-2- yl]oxy}piperidin-1- yl)-1-[4-(7H- pyrrolo[2,3- d]pyrimidin-4-yl)- 1H-pyrazol-1- yl]cydobutyl} acetonitrile
Type:
Small organic molecule
Emp. Form.:
C30H32F3N9O2
Mol. Mass.:
607.6294
SMILES:
OC1CN(Cc2cc(OC3CCN(CC3)[C@H]3C[C@@](CC#N)(C3)n3cc(cn3)-c3ncnc4[nH]ccc34)nc(c2)C(F)(F)F)C1
: