Target
Cyclin-dependent kinase 2/G1/S-specific cyclin-E1
Ligand
BDBM6746
Substrate
ING Peptide
Meas. Tech.
CDK Kinase Inhibition Assay
Temperature
298.15±n/a K
IC50
141±n/a nM
Comments
extracted
Citation
 Zhu, GConner, SEZhou, XChan, HKShih, CEngler, TAAl-Awar, RSBrooks, HBWatkins, SASpencer, CDSchultz, RMDempsey, JAConsidine, ELPatel, BROgg, CAVasudevan, VLytle, ML Synthesis of 1,7-annulated indoles and their applications in the studies of cyclin dependent kinase inhibitors. Bioorg Med Chem Lett 14:3057-61 (2004)  
Target
Name:
Cyclin-dependent kinase 2/G1/S-specific cyclin-E1
Synonyms:
CDK2/CycE CDK2/E Cyclin-Dependent Kinase 2 (CDK2) Cyclin-dependent kinase 2/cyclin E1
Type:
Protein
Mol. Mass.:
Description:
Components:
This complex has 2 components.
Component 1
Name:
Cyclin-dependent kinase 2
Synonyms:
CDK2 CDK2_HUMAN Cell division protein kinase 2 Protein cereblon/Cyclin-dependent kinase 2 | p33 protein kinase
Type:
Enzyme Subunit
Mol. Mass.:
33938.17
Organism:
Homo sapiens (Human)
Description:
P24941
Residue:
298
  
Component 2
Name:
G1/S-specific cyclin-E1
Synonyms:
CCNE CCNE1_HUMAN
Type:
Enzyme Subunit
Mol. Mass.:
47073.17
Organism:
Homo sapiens (Human)
Description:
Residue:
410
  
Inhibitor
Name:
BDBM6746
Synonyms:
1,7-Annulated indolocarbazole deriv. 13Bb | 7-fluoro-24-(hydroxymethyl)-1,4,14-triazaheptacyclo[16.7.1.0^{2,17}.0^{3,11}.0^{5,10}.0^{12,16}.0^{22,26}]hexacosa-2(17),3(11),5(10),6,8,12(16),18(26),19,21-nonaene-13,15-dione
Type:
Small organic molecule
Emp. Form.:
C24H16FN3O3
Mol. Mass.:
413.4005
SMILES:
OCC1Cc2cccc3c4c5C(=O)NC(=O)c5c5c6ccc(F)cc6[nH]c5c4n(C1)c23
:
Substrate
Name:
ING Peptide
Synonyms:
Type:
Peptide
Mol. Mass.:
1341.50
Organism:
Description:
amino acid residues 246-257 from human retinoblastoma 1 protein.
Residue:
12
INGSPRTPRRGQ