Target
cAMP-dependent protein kinase catalytic subunit alpha
Ligand
BDBM6749
Substrate
Lysine-rich histone
Meas. Tech.
CDK Kinase Inhibition Assay
Temperature
298.15±n/a K
IC50
>2000±n/a nM
Comments
extracted
Citation
 Zhu, GConner, SEZhou, XChan, HKShih, CEngler, TAAl-Awar, RSBrooks, HBWatkins, SASpencer, CDSchultz, RMDempsey, JAConsidine, ELPatel, BROgg, CAVasudevan, VLytle, ML Synthesis of 1,7-annulated indoles and their applications in the studies of cyclin dependent kinase inhibitors. Bioorg Med Chem Lett 14:3057-61 (2004)  
Target
Name:
cAMP-dependent protein kinase catalytic subunit alpha
Synonyms:
KAPCA_BOVIN PKC Protein Kinase C cAMP-Dependent Protein Kinase (PKA) cAMP-dependent protein kinase A cAMP-dependent protein kinase, alpha-catalytic subunit
Type:
Enzyme Complex
Mol. Mass.:
40627.77
Organism:
Bos taurus (bovine)
Description:
The PKA holoenzyme purified from bovine heart, exists as an inactive tetrameric complex, which consists of a regulatory dimer associated with two catalytic subunits. It requires cAMP to activate the enzymatic reaction.
Residue:
351
  
Inhibitor
Name:
BDBM6749
Synonyms:
1,7-Annulated indolocarbazole deriv. 13Be | 24-(hydroxymethyl)-7-methoxy-1,4,14-triazaheptacyclo[16.7.1.0^{2,17}.0^{3,11}.0^{5,10}.0^{12,16}.0^{22,26}]hexacosa-2(17),3(11),5(10),6,8,12(16),18(26),19,21-nonaene-13,15-dione
Type:
Small organic molecule
Emp. Form.:
C25H19N3O4
Mol. Mass.:
425.4361
SMILES:
COc1ccc2c(c1)[nH]c1c2c2C(=O)NC(=O)c2c2c3cccc4CC(CO)Cn(c34)c12
:
Substrate
Name:
Lysine-rich histone
Synonyms:
ING Peptide histone type IIIS
Type:
Peptide
Mol. Mass.:
10508.21
Organism:
Bos taurus (bovine)
Description:
Purified as a lysine rich fraction of histone H1 from calf thymus.
Residue:
105