Target
Tyrosine-protein phosphatase non-receptor type 11
Ligand
BDBM408056
Substrate
Meas. Tech.
SHP2 Allosteric Inhibition Assay
IC50
232±n/a nM
Citation
 Chen, CHChen, ZDore, MFortanet, JGGiraldes, JWKarki, RKato, MLaMarche, MJPerez, LBSendzik, MSmith, TDToure, BWilliams, S N-azaspirocycloalkane substituted N-heteroaryl compounds and compositions for inhibiting the activity of SHP2 US Patent  US10336774 Publication Date 7/2/2019 
Target
Name:
Tyrosine-protein phosphatase non-receptor type 11
Synonyms:
PTN11_HUMAN PTP-2C PTPN11 Protein tyrosine phosphatase (PTP) Shp2 Protein-tyrosine phosphatase 2C SHP2 Src homology phosphatase 2 (SHP-2) Tyrosine-protein phosphatase non-receptor type 11 (PTPN11) Tyrosine-protein phosphatase non-receptor type 11 (SHP2)
Type:
Protein phosphatase
Mol. Mass.:
68443.59
Organism:
Homo sapiens (Human)
Description:
Q06124
Residue:
597
  
Inhibitor
Name:
BDBM408056
Synonyms:
US10336774, Example 35
Type:
Small organic molecule
Emp. Form.:
C18H21F3N6OS
Mol. Mass.:
426.459
SMILES:
NC1CCOC11CCN(CC1)c1cnc(Sc2cccnc2C(F)(F)F)c(N)n1
: