Target
Protein O-GlcNAcase
Ligand
BDBM408196
Substrate
Meas. Tech.
Human O-GlcNAcase enzyme inhibition assay
IC50
600±n/a nM
Citation
 Quattropani, AKulkarni, SSGiri, AG Glycosidase inhibitors US Patent  US10336775 Publication Date 7/2/2019 
Target
Name:
Protein O-GlcNAcase
Synonyms:
2-acetamido-2-deoxy-β-D-glucopyranosidase (O-GlcNAcase) Beta-hexosaminidase (O-GlcNAcase) HEXC MEA5 N-acetyl-beta-D-glucosaminidase (O-GlcNAcase) OGA Protein O-GlcNAcase
Type:
Enzyme
Mol. Mass.:
102874.67
Organism:
Homo sapiens (Human)
Description:
O60502
Residue:
916
  
Inhibitor
Name:
BDBM408196
Synonyms:
N-(5-(4-(1-(4-chloroquinolin-7-yl)ethyl)piperazin-1-yl)-1,3,4-thiadiazol-2-yl)acetamide US11046712, No 100
Type:
Small organic molecule
Emp. Form.:
C19H21ClN6OS
Mol. Mass.:
416.928
SMILES:
CC(N1CCN(CC1)c1nnc(NC(C)=O)s1)c1ccc2c(Cl)ccnc2c1
: