Target
Protein O-GlcNAcase
Ligand
BDBM408240
Substrate
Meas. Tech.
Human O-GlcNAcase enzyme inhibition assay
IC50
125±n/a nM
Citation
 Quattropani, AKulkarni, SSGiri, AG Glycosidase inhibitors US Patent  US10336775 Publication Date 7/2/2019 
Target
Name:
Protein O-GlcNAcase
Synonyms:
2-acetamido-2-deoxy-β-D-glucopyranosidase (O-GlcNAcase) Beta-hexosaminidase (O-GlcNAcase) HEXC MEA5 N-acetyl-beta-D-glucosaminidase (O-GlcNAcase) OGA Protein O-GlcNAcase
Type:
Enzyme
Mol. Mass.:
102874.67
Organism:
Homo sapiens (Human)
Description:
O60502
Residue:
916
  
Inhibitor
Name:
BDBM408240
Synonyms:
2-(4-(1-(benzo[d][1,3]dioxol-5-yl)ethyl)piperazin-1-yl)-6,7-dihydrothiazolo[5,4-c]pyridin-4(5H)-one US11046712, No 148
Type:
Small organic molecule
Emp. Form.:
C19H22N4O3S
Mol. Mass.:
386.468
SMILES:
CC(N1CCN(CC1)c1nc2CCNC(=O)c2s1)c1ccc2OCOc2c1
: