Target
Protein O-GlcNAcase
Ligand
BDBM408246
Substrate
Meas. Tech.
Human O-GlcNAcase enzyme inhibition assay
IC50
<50±n/a nM
Citation
 Quattropani, AKulkarni, SSGiri, AG Glycosidase inhibitors US Patent  US10336775 Publication Date 7/2/2019 
Target
Name:
Protein O-GlcNAcase
Synonyms:
2-acetamido-2-deoxy-β-D-glucopyranosidase (O-GlcNAcase) Beta-hexosaminidase (O-GlcNAcase) HEXC MEA5 N-acetyl-beta-D-glucosaminidase (O-GlcNAcase) OGA Protein O-GlcNAcase
Type:
Enzyme
Mol. Mass.:
102874.67
Organism:
Homo sapiens (Human)
Description:
O60502
Residue:
916
  
Inhibitor
Name:
BDBM408246
Synonyms:
N-(5-(4-(1-(2-methylbenzo[d]thiazol-5-yl)ethyl)piperazin-1-yl)-1,3,4-thiadiazol-2-yl)acetamide US11046712, No 170
Type:
Small organic molecule
Emp. Form.:
C18H22N6OS2
Mol. Mass.:
402.537
SMILES:
CC(N1CCN(CC1)c1nnc(NC(C)=O)s1)c1ccc2sc(C)nc2c1
: