Target
Histone deacetylase 6
Ligand
BDBM408333
Substrate
Meas. Tech.
Enzymatic Activity Assay
IC50
30.0±n/a nM
Citation
 Yates, CM Metalloenzyme inhibitor compounds US Patent  US10357493 Publication Date 7/23/2019 
Target
Name:
Histone deacetylase 6
Synonyms:
Cereblon/Histone deacetylase 6 HDAC6 Histone deacetylase 6 (HDAC6) KIAA0901 | ORF Names:JM21
Type:
Chromatin regulator; hydrolase; repressor
Mol. Mass.:
131381.51
Organism:
Homo sapiens (Human)
Description:
Q9UBN7
Residue:
1215
  
Inhibitor
Name:
BDBM408333
Synonyms:
N-(1-(4-chlorophenyl)cyclopropyl)-5-(5-(difluoromethyl)-1,3,4-oxadiazol-2-yl)pyrimidin-2-amine | US10357493, Example 50
Type:
Small organic molecule
Emp. Form.:
C16H12ClF2N5O
Mol. Mass.:
363.749
SMILES:
FC(F)c1nnc(o1)-c1cnc(NC2(CC2)c2ccc(Cl)cc2)nc1
: