Target
Histone deacetylase 6
Ligand
BDBM408396
Substrate
Meas. Tech.
Enzymatic Activity Assay
IC50
21.0±n/a nM
Citation
 Yates, CM Metalloenzyme inhibitor compounds US Patent  US10357493 Publication Date 7/23/2019 
Target
Name:
Histone deacetylase 6
Synonyms:
Cereblon/Histone deacetylase 6 HDAC6 Histone deacetylase 6 (HDAC6) KIAA0901 | ORF Names:JM21
Type:
Chromatin regulator; hydrolase; repressor
Mol. Mass.:
131381.51
Organism:
Homo sapiens (Human)
Description:
Q9UBN7
Residue:
1215
  
Inhibitor
Name:
BDBM408396
Synonyms:
US10357493, Example 113
Type:
Small organic molecule
Emp. Form.:
C17H17F3N6O3S
Mol. Mass.:
442.415
SMILES:
CN(CC(Nc1ncc(cn1)-c1nnc(o1)C(F)F)c1ccc(F)cc1)S(C)(=O)=O
: