Target
Neutrophil collagenase
Ligand
BDBM50442363
Substrate
Meas. Tech.
Enzyme Inhibition Assay
Ki
930±20 nM
Citation
 Chang, MMobashery, S Acceleration of diabetic wound healing US Patent  US10357546 Publication Date 7/23/2019 
Target
Name:
Neutrophil collagenase
Synonyms:
CLG1 MMP8 Matrix metalloproteinase-8 PMNL collagenase | PMNL-CL
Type:
Enzyme
Mol. Mass.:
53413.48
Organism:
Homo sapiens (Human)
Description:
P22894
Residue:
467
  
Inhibitor
Name:
BDBM50442363
Synonyms:
CHEMBL2442890 | US10357546, ND-395
Type:
Small organic molecule
Emp. Form.:
C18H18O6S2
Mol. Mass.:
394.462
SMILES:
CCOC(=O)Oc1ccc(Oc2ccc(cc2)S(=O)(=O)CC2CS2)cc1
: