Target
cGMP-dependent 3',5'-cyclic phosphodiesterase
Ligand
BDBM408479
Substrate
Meas. Tech.
Fluorescence Polarization (FP)
Ki
36.3±n/a nM
Citation
 Shen, DSinz, CJCrespo, AWilson, JEMcCracken, TXu, SLi, H Triazolyl pyrimidinone compounds as PDE2 inhibitors US Patent  US10358435 Publication Date 7/23/2019 
Target
Name:
cGMP-dependent 3',5'-cyclic phosphodiesterase
Synonyms:
CGS-PDE Homo sapiens phosphodiesterase 2A (PDE2A) PDE2A cGSPDE
Type:
Enzyme Catalytic Domain
Mol. Mass.:
105691.58
Organism:
Homo sapiens (Human)
Description:
O00408
Residue:
941
  
Inhibitor
Name:
BDBM408479
Synonyms:
US10358435, Example 1
Type:
Small organic molecule
Emp. Form.:
C11H12N2O
Mol. Mass.:
188.2258
SMILES:
COc1cc(nc(CC2CC2)n1)C#C
: