Target
cGMP-dependent 3',5'-cyclic phosphodiesterase
Ligand
BDBM408483
Substrate
Meas. Tech.
Fluorescence Polarization (FP)
Ki
52.2±n/a nM
Citation
 Shen, DSinz, CJCrespo, AWilson, JEMcCracken, TXu, SLi, H Triazolyl pyrimidinone compounds as PDE2 inhibitors US Patent  US10358435 Publication Date 7/23/2019 
Target
Name:
cGMP-dependent 3',5'-cyclic phosphodiesterase
Synonyms:
CGS-PDE Homo sapiens phosphodiesterase 2A (PDE2A) PDE2A cGSPDE
Type:
Enzyme Catalytic Domain
Mol. Mass.:
105691.58
Organism:
Homo sapiens (Human)
Description:
O00408
Residue:
941
  
Inhibitor
Name:
BDBM408483
Synonyms:
4-ethynyl-6-((4-methoxybenzyl)oxy)- 2-methylpyrimidine | US10358435, Example 5
Type:
Small organic molecule
Emp. Form.:
C15H14N2O2
Mol. Mass.:
254.2839
SMILES:
COc1ccc(COc2cc(nc(C)n2)C#C)cc1
: