Target
cGMP-dependent 3',5'-cyclic phosphodiesterase
Ligand
BDBM408514
Substrate
Meas. Tech.
Fluorescence Polarization (FP)
Ki
5.40±n/a nM
Citation
 Shen, DSinz, CJCrespo, AWilson, JEMcCracken, TXu, SLi, H Triazolyl pyrimidinone compounds as PDE2 inhibitors US Patent  US10358435 Publication Date 7/23/2019 
Target
Name:
cGMP-dependent 3',5'-cyclic phosphodiesterase
Synonyms:
CGS-PDE Homo sapiens phosphodiesterase 2A (PDE2A) PDE2A cGSPDE
Type:
Enzyme Catalytic Domain
Mol. Mass.:
105691.58
Organism:
Homo sapiens (Human)
Description:
O00408
Residue:
941
  
Inhibitor
Name:
BDBM408514
Synonyms:
2-methyl-6-(1-(2-(2-methyl-4- (trifluoromethyl)phenyl)propan- 2-yl)-1H-1,2,3-triazol-4-yl) pyrimidin-4(3H)-one | US10358435, Example 31
Type:
Small organic molecule
Emp. Form.:
C18H18F3N5O
Mol. Mass.:
377.3636
SMILES:
Cc1nc(cc(=O)[nH]1)-c1cn(nn1)C(C)(C)c1ccc(cc1C)C(F)(F)F
: