Target
cGMP-dependent 3',5'-cyclic phosphodiesterase
Ligand
BDBM408537
Substrate
Meas. Tech.
Fluorescence Polarization (FP)
Ki
73.2±n/a nM
Citation
 Shen, DSinz, CJCrespo, AWilson, JEMcCracken, TXu, SLi, H Triazolyl pyrimidinone compounds as PDE2 inhibitors US Patent  US10358435 Publication Date 7/23/2019 
Target
Name:
cGMP-dependent 3',5'-cyclic phosphodiesterase
Synonyms:
CGS-PDE Homo sapiens phosphodiesterase 2A (PDE2A) PDE2A cGSPDE
Type:
Enzyme Catalytic Domain
Mol. Mass.:
105691.58
Organism:
Homo sapiens (Human)
Description:
O00408
Residue:
941
  
Inhibitor
Name:
BDBM408537
Synonyms:
2-methyl-6-(7-(4- (trifluoromethyl)phenyl)-6,7- dihydro-4H-[1,2,3]triazolo[5,1- c][1,4]oxazin-3-yl)pyrimidin- 4(3H)-one | US10358435, Example 53
Type:
Small organic molecule
Emp. Form.:
C17H14F3N5O2
Mol. Mass.:
377.3206
SMILES:
Cc1nc(cc(=O)[nH]1)-c1nnn2C(COCc12)c1ccc(cc1)C(F)(F)F
: