Target
cGMP-dependent 3',5'-cyclic phosphodiesterase
Ligand
BDBM408582
Substrate
Meas. Tech.
Fluorescence Polarization (FP)
Ki
1.50±n/a nM
Citation
 Shen, DSinz, CJCrespo, AWilson, JEMcCracken, TXu, SLi, H Triazolyl pyrimidinone compounds as PDE2 inhibitors US Patent  US10358435 Publication Date 7/23/2019 
Target
Name:
cGMP-dependent 3',5'-cyclic phosphodiesterase
Synonyms:
CGS-PDE Homo sapiens phosphodiesterase 2A (PDE2A) PDE2A cGSPDE
Type:
Enzyme Catalytic Domain
Mol. Mass.:
105691.58
Organism:
Homo sapiens (Human)
Description:
O00408
Residue:
941
  
Inhibitor
Name:
BDBM408582
Synonyms:
(R)- or (S)-6-(6-(2-Fluoro-4- (trifluoromethyl)phenyl)-6-methyl- 5,6-dihydro-4H-pyrolo[1,2- c][1,2,3]triazol-3-yl)-2- methylpyrimidin-4(3H)-one US10358435, Example 98
Type:
Small organic molecule
Emp. Form.:
C18H15F4N5O
Mol. Mass.:
393.3382
SMILES:
Cc1nc(cc(=O)[nH]1)-c1nnn2c1CCC2(C)c1ccc(cc1F)C(F)(F)F
: