Target
Tyrosine-protein kinase Lck
Ligand
BDBM408593
Substrate
Meas. Tech.
Kinase Assay
IC50
>10000±n/a nM
Citation
 Liao, XLi, JLu, ZZhou, YGao, A Bruton's tyrosine kinase inhibitors US Patent  US10358446 Publication Date 7/23/2019 
Target
Name:
Tyrosine-protein kinase Lck
Synonyms:
2.7.10.2 LCK_HUMAN Leukocyte C-terminal Src kinase Lymphocyte-specific protein tyrosine kinase Protein YT16 Proto-oncogene tyrosine-protein kinase LCK T cell-specific protein-tyrosine kinase
Type:
Mol. Mass.:
57987.83
Organism:
Homo sapiens (Human)
Description:
P06239
Residue:
509
  
Inhibitor
Name:
BDBM408593
Synonyms:
US10358446, Compound 31
Type:
Small organic molecule
Emp. Form.:
C26H24N4O3
Mol. Mass.:
440.4938
SMILES:
C=CC(=O)N1CCC(CC1)n1c2ccncc2n(-c2ccc(Oc3ccccc3)cc2)c1=O
: