Target
Tyrosine-protein kinase Lyn
Ligand
BDBM408596
Substrate
Meas. Tech.
Kinase Assay
IC50
>10000±n/a nM
Citation
 Liao, XLi, JLu, ZZhou, YGao, A Bruton's tyrosine kinase inhibitors US Patent  US10358446 Publication Date 7/23/2019 
Target
Name:
Tyrosine-protein kinase Lyn
Synonyms:
JTK8 LYN_HUMAN Tyrosine-protein kinase Lyn (LYN) p53Lyn | p56Lyn
Type:
Protein
Mol. Mass.:
58575.92
Organism:
Homo sapiens (Human)
Description:
P07948
Residue:
512
  
Inhibitor
Name:
BDBM408596
Synonyms:
US10358446, Compound 60
Type:
Small organic molecule
Emp. Form.:
C26H22ClFN4O3
Mol. Mass.:
492.929
SMILES:
Fc1c(Cl)cccc1Oc1ccc(cc1)-n1c2cnccc2n([C@@H]2CCCN(C2)C(=O)C=C)c1=O
: