Target
Tyrosine-protein kinase Blk
Ligand
BDBM408598
Substrate
Meas. Tech.
Kinase Assay
IC50
550±n/a nM
Citation
 Liao, XLi, JLu, ZZhou, YGao, A Bruton's tyrosine kinase inhibitors US Patent  US10358446 Publication Date 7/23/2019 
Target
Name:
Tyrosine-protein kinase Blk
Synonyms:
B lymphoid tyrosine kinase BLK_HUMAN Tyrosine-protein kinase BLK (BLK) | p55-Blk
Type:
Protein
Mol. Mass.:
57711.88
Organism:
Homo sapiens (Human)
Description:
P51451
Residue:
505
  
Inhibitor
Name:
BDBM408598
Synonyms:
US10358446, Compound 128
Type:
Small organic molecule
Emp. Form.:
C27H18F2N4O3
Mol. Mass.:
484.4536
SMILES:
Fc1cc(F)cc(Oc2ccc(cc2)-n2c3cnccc3n(-c3cccc(NC(=O)C=C)c3)c2=O)c1
: