Target
Tyrosine-protein kinase BTK
Ligand
BDBM294480
Substrate
Meas. Tech.
Enzymatic Assay
pH
7.5±n/a
Temperature
298.15±n/a K
IC50
0.399±0.0 nM
Comments
extracted
Citation
 Xu, XWang, XMao, LZhao, LXi, B Pyrrolo[2,3-d]pyrimidine compounds as inhibitors of protein kinases US Patent  US9586965 Publication Date 3/7/2017 
Target
Name:
Tyrosine-protein kinase BTK
Synonyms:
AGMX1 Agammaglobulinaemia tyrosine kinase B cell progenitor kinase BPK BTK_HUMAN Tyrosine Kinase BTK Tyrosine-protein kinase BTK (BTK)
Type:
Enzyme
Mol. Mass.:
76289.95
Organism:
Homo sapiens (Human)
Description:
Q06187
Residue:
659
  
Inhibitor
Name:
BDBM294480
Synonyms:
N-(3-((2-((3-fluoro-4-(4-methylpiperazin-1- yl)phenyl)amino)-7H-pyrrolo[2,3-d]- pyrimidin-4-yl)oxy)phenyl)acrylamide | US9586965, Cpd 3
Type:
Small organic molecule
Emp. Form.:
C26H26FN7O2
Mol. Mass.:
487.5287
SMILES:
CN1CCN(CC1)c1ccc(Nc2nc(Oc3cccc(NC(=O)C=C)c3)c3cc[nH]c3n2)cc1F
: