Target
Dual specificity calcium/calmodulin-dependent 3',5'-cyclic nucleotide phosphodiesterase 1B
Ligand
BDBM289685
Substrate
Meas. Tech.
in vitro enzymatic assay
IC50
<100.0±n/a nM
Citation
 Branstetter, BBreitenbucher, JDyck, BGomez, LHudson, ARMarrone, TJPeters, MVickers, TWeinhouse, MI Therapeutic thiophene-, furan-, and pyridine-fused azolopyrimidin-5-(6H)-ones US Patent  US10376514 Publication Date 8/13/2019 
Target
Name:
Dual specificity calcium/calmodulin-dependent 3',5'-cyclic nucleotide phosphodiesterase 1B
Synonyms:
63 kDa Cam-PDE Calcium/calmodulin-dependent 3',5'-cyclic nucleotide phosphodiesterase 1B PDE1B PDE1B_HUMAN Phosphodiesterase 1B Phosphodiesterase Type 1 (PDE1B) | Phosphodiesterase, PDE1/PDE5
Type:
Enzyme
Mol. Mass.:
61366.51
Organism:
Homo sapiens (Human)
Description:
Residue:
536
  
Inhibitor
Name:
BDBM289685
Synonyms:
8-(Cyclopropanecarbonyl)-6-(4-methoxybenzyl)-8,9,10,11-tetrahydropyrido[3',2':4,5]thieno[3,2-e][1,2,4]triazolo[1,5-c]pyrimidin-5(6H)-one US10376514, Example 174
Type:
Small organic molecule
Emp. Form.:
C22H21N5O3S
Mol. Mass.:
435.499
SMILES:
COc1ccc(Cn2c3sc4N(CCCc4c3c3ncnn3c2=O)C(=O)C2CC2)cc1
: