Target
Plasma kallikrein
Ligand
BDBM408708
Substrate
Meas. Tech.
Inhibitory Activity In Vitro Assay
IC50
280±n/a nM
Citation
 Davie, RLEdwards, HJEvans, DMHodgson, ST N-((het) arylmethyl)-heteroaryl-carboxamides compounds as plasma kallikrein inhibitors US Patent  US10364238 Publication Date 7/30/2019 
Target
Name:
Plasma kallikrein
Synonyms:
Fletcher factor KLKB1 Kallikrein Plasma kallikrein heavy chain Plasma prekallikrein
Type:
Protein
Mol. Mass.:
71391.16
Organism:
Homo sapiens (Human)
Description:
P03952
Residue:
638
  
Inhibitor
Name:
BDBM408708
Synonyms:
N-[(2-fluoro-4-methylphenyl)methyl]-1-({4-[(4-methylpyrazol-1- yl)methyl]phenyl}methyl)-3-(trifluoromethyl)pyrazole-4-carboxamide US11001578, Example 28 US11198691, Example 28
Type:
Small organic molecule
Emp. Form.:
C25H23F4N5O
Mol. Mass.:
485.4766
SMILES:
Cc1cnn(Cc2ccc(Cn3cc(C(=O)NCc4ccc(C)cc4F)c(n3)C(F)(F)F)cc2)c1
: