Target
Plasma kallikrein
Ligand
BDBM408726
Substrate
Meas. Tech.
Inhibitory Activity In Vitro Assay
IC50
647±n/a nM
Citation
 Davie, RLEdwards, HJEvans, DMHodgson, ST N-((het) arylmethyl)-heteroaryl-carboxamides compounds as plasma kallikrein inhibitors US Patent  US10364238 Publication Date 7/30/2019 
Target
Name:
Plasma kallikrein
Synonyms:
Fletcher factor KLKB1 Kallikrein Plasma kallikrein heavy chain Plasma prekallikrein
Type:
Protein
Mol. Mass.:
71391.16
Organism:
Homo sapiens (Human)
Description:
P03952
Residue:
638
  
Inhibitor
Name:
BDBM408726
Synonyms:
N-[(2-carbamoylphenyl)methyl]-3-cyclopropyl-1-({4-[(2-oxopyridin-1- yl)methyl]phenyl}methyl)pyrazole-4-carboxamide US11001578, Example 48 US11198691, Example 48
Type:
Small organic molecule
Emp. Form.:
C28H27N5O3
Mol. Mass.:
481.5457
SMILES:
NC(=O)c1ccccc1CNC(=O)c1cn(Cc2ccc(Cn3ccccc3=O)cc2)nc1C1CC1
: