Target
Kallikrein-1
Ligand
BDBM408753
Substrate
Meas. Tech.
Inhibitory Activity In Vitro Assay
IC50
>10000±n/a nM
Citation
 Davie, RLEdwards, HJEvans, DMHodgson, ST N-((het) arylmethyl)-heteroaryl-carboxamides compounds as plasma kallikrein inhibitors US Patent  US10364238 Publication Date 7/30/2019 
Target
Name:
Kallikrein-1
Synonyms:
KLK1 Kallikrein 1 Kidney/pancreas/salivary gland kallikrein | Tissue kallikrein
Type:
Enzyme
Mol. Mass.:
28874.69
Organism:
Homo sapiens (Human)
Description:
P06870
Residue:
262
  
Inhibitor
Name:
BDBM408753
Synonyms:
3-amino-N-{[2-fluoro-6-(trifluoromethyl)phenyl]methyl}-1-({4-[(2-oxopyridin-1- yl)methyl]phenyl}methyl)pyrazole-4-carboxamide US11001578, Example 70 US11198691, Example 70
Type:
Small organic molecule
Emp. Form.:
C25H21F4N5O2
Mol. Mass.:
499.4602
SMILES:
Nc1nn(Cc2ccc(Cn3ccccc3=O)cc2)cc1C(=O)NCc1c(F)cccc1C(F)(F)F
: