Target
Pantetheinase
Ligand
BDBM408838
Substrate
Meas. Tech.
Enzymatic Assay
IC50
3.30±n/a nM
Citation
 Bosanac, TBurke, MJCook, BNDisalvo, DTKirrane, Jr., TMShen, Y Heteroaromatic compounds as Vanin inhibitors US Patent  US10364255 Publication Date 7/30/2019 
Target
Name:
Pantetheinase
Synonyms:
Pantetheine hydrolase VNN1 Vanin-1 | Vascular non-inflammatory molecule 1
Type:
Enzyme Catalytic Domain
Mol. Mass.:
57002.46
Organism:
Homo sapiens (Human)
Description:
O95497
Residue:
513
  
Inhibitor
Name:
BDBM408838
Synonyms:
US10364255, Ex. 29
Type:
Small organic molecule
Emp. Form.:
C16H22N4O3
Mol. Mass.:
318.3709
SMILES:
C[C@@H]1COc2cc(cnc2N1)C(=O)N1CC[C@@H](C1)N(C)C(C)=O
: