Target
Pantetheinase
Ligand
BDBM408847
Substrate
Meas. Tech.
Enzymatic Assay
IC50
8.10±n/a nM
Citation
 Bosanac, TBurke, MJCook, BNDisalvo, DTKirrane, Jr., TMShen, Y Heteroaromatic compounds as Vanin inhibitors US Patent  US10364255 Publication Date 7/30/2019 
Target
Name:
Pantetheinase
Synonyms:
Pantetheine hydrolase VNN1 Vanin-1 | Vascular non-inflammatory molecule 1
Type:
Enzyme Catalytic Domain
Mol. Mass.:
57002.46
Organism:
Homo sapiens (Human)
Description:
O95497
Residue:
513
  
Inhibitor
Name:
BDBM408847
Synonyms:
US10364255, Ex. 39
Type:
Small organic molecule
Emp. Form.:
C15H20N4O3
Mol. Mass.:
304.3443
SMILES:
CN([C@H]1CCN(C1)C(=O)c1cnc2NCCOc2c1)C(C)=O
: