Target
Bile acid receptor
Ligand
BDBM408882
Substrate
Meas. Tech.
In Vitro FXR Assay (TK)
EC50
<1000±n/a nM
Citation
 Smith, NDGovek, SP Farnesoid X receptor agonists and uses thereof US Patent  US10377717 Publication Date 8/13/2019 
Target
Name:
Bile acid receptor
Synonyms:
BAR FXR HRR1 NR1H4_HUMAN RIP14 Retinoid X receptor-interacting protein 14 | farnesoid x receptor
Type:
Nuclear Receptor
Mol. Mass.:
55916.24
Organism:
Homo sapiens (Human)
Description:
Q96RI1
Residue:
486
  
Inhibitor
Name:
BDBM408882
Synonyms:
Methyl 1-(N-((4'-(dimethylamino)-[1,1'- biphenyl]-4- yl)methyl) cyclohexanecarboxamido)isoquinoline- 6-carboxylate | US10377717, Compound 13
Type:
Small organic molecule
Emp. Form.:
C33H35N3O3
Mol. Mass.:
521.6493
SMILES:
COC(=O)c1ccc2c(nccc2c1)N(Cc1ccc(cc1)-c1ccc(cc1)N(C)C)C(=O)C1CCCCC1
: