Target
Bile acid receptor
Ligand
BDBM408969
Substrate
Meas. Tech.
In Vitro FXR Assay (TK)
EC50
5500±n/a nM
Citation
 Smith, NDGovek, SP Farnesoid X receptor agonists and uses thereof US Patent  US10377717 Publication Date 8/13/2019 
Target
Name:
Bile acid receptor
Synonyms:
BAR FXR HRR1 NR1H4_HUMAN RIP14 Retinoid X receptor-interacting protein 14 | farnesoid x receptor
Type:
Nuclear Receptor
Mol. Mass.:
55916.24
Organism:
Homo sapiens (Human)
Description:
Q96RI1
Residue:
486
  
Inhibitor
Name:
BDBM408969
Synonyms:
Methyl 1-(N-((1-(4-methoxy-3- methylphenyl) piperidin-4-yl)methyl)-3,3- dimethylbutanamido) isoquinoline-6-carboxylate | US10377717, Compound 98
Type:
Small organic molecule
Emp. Form.:
C31H39N3O4
Mol. Mass.:
517.6591
SMILES:
COC(=O)c1ccc2c(nccc2c1)N(CC1CCN(CC1)c1ccc(OC)c(C)c1)C(=O)CC(C)(C)C
: