Target
5'-AMP-activated protein kinase catalytic subunit alpha-2
Ligand
BDBM328109
Substrate
Meas. Tech.
enzyme-linked immunosorbent assay
EC50
<500±n/a nM
Citation
 Goff, DPayan, DSingh, RShaw, SCarroll, DHitoshi, Y AMPK-activating heterocyclic compounds and methods for using the same US Patent  US10377742 Publication Date 8/13/2019 
Target
Name:
5'-AMP-activated protein kinase catalytic subunit alpha-2
Synonyms:
AAPK2_HUMAN AMP-activated protein kinase, alpha-2 subunit AMPK subunit alpha-2 AMPK2 Hydroxymethylglutaryl-CoA reductase kinase | PRKAA2
Type:
Enzyme
Mol. Mass.:
62331.02
Organism:
Homo sapiens (Human)
Description:
P54646
Residue:
552
  
Inhibitor
Name:
BDBM328109
Synonyms:
6-(4-(4- (cyclopropylsulfonyl) phenoxy)piperidine-1- carbonyl)-N-(6-(4- fluorophenoxy)pyridin- 3-yl)nicotinamide US9663496, Compound 247
Type:
Small organic molecule
Emp. Form.:
C32H29FN4O6S
Mol. Mass.:
616.659
SMILES:
Fc1ccc(Oc2ccc(NC(=O)c3ccc(nc3)C(=O)N3CCC(CC3)Oc3ccc(cc3)S(=O)(=O)C3CC3)cn2)cc1
: