Target
5'-AMP-activated protein kinase catalytic subunit alpha-2
Ligand
BDBM328263
Substrate
Meas. Tech.
enzyme-linked immunosorbent assay
EC50
3000±n/a nM
Citation
 Goff, DPayan, DSingh, RShaw, SCarroll, DHitoshi, Y AMPK-activating heterocyclic compounds and methods for using the same US Patent  US10377742 Publication Date 8/13/2019 
Target
Name:
5'-AMP-activated protein kinase catalytic subunit alpha-2
Synonyms:
AAPK2_HUMAN AMP-activated protein kinase, alpha-2 subunit AMPK subunit alpha-2 AMPK2 Hydroxymethylglutaryl-CoA reductase kinase | PRKAA2
Type:
Enzyme
Mol. Mass.:
62331.02
Organism:
Homo sapiens (Human)
Description:
P54646
Residue:
552
  
Inhibitor
Name:
BDBM328263
Synonyms:
N-(1-(4- acetamidobenzyl) piperidin-4-yl)-6-(4-(4- methoxybenzoyl) piperidine-1- carbonyl)nicotinamide US9663496, Compound 401
Type:
Small organic molecule
Emp. Form.:
C34H39N5O5
Mol. Mass.:
597.704
SMILES:
COc1ccc(cc1)C(=O)C1CCN(CC1)C(=O)c1ccc(cn1)C(=O)NC1CCN(Cc2ccc(NC(C)=O)cc2)CC1
: