Target
5'-AMP-activated protein kinase catalytic subunit alpha-2
Ligand
BDBM328314
Substrate
Meas. Tech.
enzyme-linked immunosorbent assay
EC50
<500±n/a nM
Citation
 Goff, DPayan, DSingh, RShaw, SCarroll, DHitoshi, Y AMPK-activating heterocyclic compounds and methods for using the same US Patent  US10377742 Publication Date 8/13/2019 
Target
Name:
5'-AMP-activated protein kinase catalytic subunit alpha-2
Synonyms:
AAPK2_HUMAN AMP-activated protein kinase, alpha-2 subunit AMPK subunit alpha-2 AMPK2 Hydroxymethylglutaryl-CoA reductase kinase | PRKAA2
Type:
Enzyme
Mol. Mass.:
62331.02
Organism:
Homo sapiens (Human)
Description:
P54646
Residue:
552
  
Inhibitor
Name:
BDBM328314
Synonyms:
N-((3R,4R)-1-(4- cyanobenzyl)-3- fluoropiperidin-4-yl)-6- (4-(4-methoxybenzoyl) piperidine-1- carbonyl)nicotinamide US9663496, Compound 452
Type:
Small organic molecule
Emp. Form.:
C33H34FN5O4
Mol. Mass.:
583.6526
SMILES:
COc1ccc(cc1)C(=O)C1CCN(CC1)C(=O)c1ccc(cn1)C(=O)N[C@@H]1CCN(Cc2ccc(cc2)C#N)C[C@H]1F
: