Target
5'-AMP-activated protein kinase catalytic subunit alpha-2
Ligand
BDBM328324
Substrate
Meas. Tech.
enzyme-linked immunosorbent assay
EC50
<500±n/a nM
Citation
 Goff, DPayan, DSingh, RShaw, SCarroll, DHitoshi, Y AMPK-activating heterocyclic compounds and methods for using the same US Patent  US10377742 Publication Date 8/13/2019 
Target
Name:
5'-AMP-activated protein kinase catalytic subunit alpha-2
Synonyms:
AAPK2_HUMAN AMP-activated protein kinase, alpha-2 subunit AMPK subunit alpha-2 AMPK2 Hydroxymethylglutaryl-CoA reductase kinase | PRKAA2
Type:
Enzyme
Mol. Mass.:
62331.02
Organism:
Homo sapiens (Human)
Description:
P54646
Residue:
552
  
Inhibitor
Name:
BDBM328324
Synonyms:
N-(6-(4- acetylphenoxy)pyridin- 3-yl)-6-(4-(4- methoxybenzoyl) piperidine-1- carbonyl)nicotinamide US9663496, Compound 462
Type:
Small organic molecule
Emp. Form.:
C33H30N4O6
Mol. Mass.:
578.6145
SMILES:
COc1ccc(cc1)C(=O)C1CCN(CC1)C(=O)c1ccc(cn1)C(=O)Nc1ccc(Oc2ccc(cc2)C(C)=O)nc1
: