Target
Bifunctional epoxide hydrolase 2
Ligand
BDBM50100518
Substrate
Meas. Tech.
FRET-displacement assay
Ki
0.660±0.30 nM
Citation
 Hammock, BDLee, KSInceoglu, AB Potent soluble epdxide hydrolase inhibitors US Patent  US10377744 Publication Date 8/13/2019 
Target
Name:
Bifunctional epoxide hydrolase 2
Synonyms:
Cytosolic epoxide hydrolase 2 EPHX2 HYES_HUMAN Soluble epoxide hydrolase (sEH) | epoxide hydrolase 2, cytoplasmic
Type:
Enzyme
Mol. Mass.:
62613.07
Organism:
Homo sapiens (Human)
Description:
P34913
Residue:
555
  
Inhibitor
Name:
BDBM50100518
Synonyms:
CHEMBL3327064 | US10377744, Compound No. 2389
Type:
Small organic molecule
Emp. Form.:
C17H22F3N3O2
Mol. Mass.:
357.3707
SMILES:
CC(C)C(=O)N1CCC(CC1)NC(=O)Nc1ccc(cc1)C(F)(F)F
: