Target
Glutamate receptor ionotropic, NMDA 2B
Ligand
BDBM409581
Substrate
Meas. Tech.
Inhibition of Specific Binding to the Rat NR1/NR2B Receptor
IC50
20.0±n/a nM
Citation
 Chrovian, CCLetavic, MARech, JCSoyode-Johnson, AWall, JL Substituted 4-azaindoles and their use as GluN2B receptor modulators US Patent  US10377753 Publication Date 8/13/2019 
Target
Name:
Glutamate receptor ionotropic, NMDA 2B
Synonyms:
GRIN2B Glutamate [NMDA] receptor subunit epsilon 2 N-methyl D-aspartate receptor subtype 2B NMDAR2B NR3 | hNR3
Type:
PROTEIN
Mol. Mass.:
166375.46
Organism:
Homo sapiens (Human)
Description:
ChEMBL_1438829
Residue:
1484
  
Inhibitor
Name:
BDBM409581
Synonyms:
2-[6-(2,4-Difluoro-3-methyl-phenyl)pyrrolo[3,2-b]pyridin-1-yl]- | US10377753, Example 447
Type:
Small organic molecule
Emp. Form.:
C18H17F2N3O
Mol. Mass.:
329.3439
SMILES:
CN(C)C(=O)Cn1ccc2ncc(cc12)-c1ccc(F)c(C)c1F
: