Target
Alkaline phosphatase, tissue-nonspecific isozyme
Ligand
BDBM409907
Substrate
Meas. Tech.
Enzyme Kinetic Assay
IC50
>1000±n/a nM
Citation
 Pinkerton, ABDahl, RCosford, NDMillan, JL Sulfonamide compounds and uses as TNAP inhibitors US Patent  US10370333 Publication Date 8/6/2019 
Target
Name:
Alkaline phosphatase, tissue-nonspecific isozyme
Synonyms:
ALPL tissue-nonspecific alkaline phosphatase precursor
Type:
PROTEIN
Mol. Mass.:
57306.17
Organism:
Homo sapiens (Human)
Description:
ChEMBL_1448917
Residue:
524
  
Inhibitor
Name:
BDBM409907
Synonyms:
US10370333, Example XI-16
Type:
Small organic molecule
Emp. Form.:
C17H13F3N2O4S2
Mol. Mass.:
430.421
SMILES:
COc1ccc(OC(F)(F)F)cc1S(=O)(=O)Nc1cncc(c1)-c1cccs1
: