Target
Alkaline phosphatase, tissue-nonspecific isozyme
Ligand
BDBM409922
Substrate
Meas. Tech.
Enzyme Kinetic Assay
IC50
550±n/a nM
Citation
 Pinkerton, ABDahl, RCosford, NDMillan, JL Sulfonamide compounds and uses as TNAP inhibitors US Patent  US10370333 Publication Date 8/6/2019 
Target
Name:
Alkaline phosphatase, tissue-nonspecific isozyme
Synonyms:
ALPL tissue-nonspecific alkaline phosphatase precursor
Type:
PROTEIN
Mol. Mass.:
57306.17
Organism:
Homo sapiens (Human)
Description:
ChEMBL_1448917
Residue:
524
  
Inhibitor
Name:
BDBM409922
Synonyms:
US10370333, Example XI-29
Type:
Small organic molecule
Emp. Form.:
C15H9BrF3N3O3S2
Mol. Mass.:
480.279
SMILES:
FC(F)(F)Oc1ccc(Br)cc1S(=O)(=O)Nc1cncc(c1)-c1cscn1
: