Target
Toll-like receptor 7
Ligand
BDBM409986
Substrate
Meas. Tech.
Pharmacological Assay
EC50
>100000±n/a nM
Citation
 Wang, LYun, HZhang, WZhu, WZhang, Z Benzazepine dicarboxamide compounds with tertiary amide function US Patent  US10370338 Publication Date 8/6/2019 
Target
Name:
Toll-like receptor 7
Synonyms:
ORF Names:UNQ248/PRO285 TLR7_HUMAN | Toll-like receptor 7 (TLR7)
Type:
Enzyme
Mol. Mass.:
120945.35
Organism:
Homo sapiens (Human)
Description:
Q9NYK1
Residue:
1049
  
Inhibitor
Name:
BDBM409986
Synonyms:
2-Amino-8-[3-[4-(aminomethyl)anilino]pyrrolidine-1-carbonyl]-N,N-dipropyl-3H-1-benzazepine-4-carboxamide | US10370338, Example 18
Type:
Small organic molecule
Emp. Form.:
C29H38N6O2
Mol. Mass.:
502.651
SMILES:
CCCN(CCC)C(=O)C1=Cc2ccc(cc2N=C(N)C1)C(=O)N1CCC(C1)Nc1ccc(CN)cc1
: