Target
Toll-like receptor 7
Ligand
BDBM409990
Substrate
Meas. Tech.
Pharmacological Assay
EC50
32000±n/a nM
Citation
 Wang, LYun, HZhang, WZhu, WZhang, Z Benzazepine dicarboxamide compounds with tertiary amide function US Patent  US10370338 Publication Date 8/6/2019 
Target
Name:
Toll-like receptor 7
Synonyms:
ORF Names:UNQ248/PRO285 TLR7_HUMAN | Toll-like receptor 7 (TLR7)
Type:
Enzyme
Mol. Mass.:
120945.35
Organism:
Homo sapiens (Human)
Description:
Q9NYK1
Residue:
1049
  
Inhibitor
Name:
BDBM409990
Synonyms:
2-Amino-8-[3-[(E)-but-2-enoxy]azetidine-1-carbonyl]-N,N-dipropyl-3H-1-benzazepine-4-carboxamide | US10370338, Example 22
Type:
Small organic molecule
Emp. Form.:
C25H34N4O3
Mol. Mass.:
438.5625
SMILES:
CCCN(CCC)C(=O)C1=Cc2ccc(cc2N=C(N)C1)C(=O)N1CC(C1)OC\C=C\C
: