Target
Mitogen-activated protein kinase kinase kinase 5
Ligand
BDBM410045
Substrate
Meas. Tech.
Enzymatic Assay
IC50
1.84±0.64 nM
Citation
 Liu, LZZhang, HWang, XLiu, G Cyclobutyl-imidazolidinone compounds US Patent  US10370352 Publication Date 8/6/2019 
Target
Name:
Mitogen-activated protein kinase kinase kinase 5
Synonyms:
ASK1 MAP3K5 MEKK5
Type:
Protein
Mol. Mass.:
154514.93
Organism:
Homo sapiens (Human)
Description:
Q99683
Residue:
1374
  
Inhibitor
Name:
BDBM410045
Synonyms:
1-(3-(4-(tert-Butyl)-1H-imidazol-1-yl)cyclobutyl)-3-(6-(4-isopropyl-4H-1,2,4-triazol-3-yl)pyridin-2-yl)imidazolidin-2-one | US10370352, Example 5
Type:
Small organic molecule
Emp. Form.:
C24H32N8O
Mol. Mass.:
448.5639
SMILES:
CC(C)n1cnnc1-c1cccc(n1)N1CCN(C2CC(C2)n2cnc(c2)C(C)(C)C)C1=O
: