Target
Discoidin domain-containing receptor 2
Ligand
BDBM410050
Substrate
Meas. Tech.
Lantha Screen Eu Kinase Activity Assay
IC50
5800±n/a nM
Citation
 Brekken, RADing, KRen, XTu, ZWang, ZAguilera, KY Small-molecule inhibitors targeting discoidin domain receptor 1 and uses thereof US Patent  US10370360 Publication Date 8/6/2019 
Target
Name:
Discoidin domain-containing receptor 2
Synonyms:
DDR2 Discoidin domain receptor 2 (DDR2) Discoidin domain-containing receptor 2 (DDR2) NTRKR3 TYRO10
Type:
Protein
Mol. Mass.:
96717.07
Organism:
Homo sapiens (Human)
Description:
Q16832
Residue:
855
  
Inhibitor
Name:
BDBM410050
Synonyms:
D2217 | US10370360, Example 2
Type:
Small organic molecule
Emp. Form.:
C28H31F3N6O
Mol. Mass.:
524.5805
SMILES:
CC1CN(Cc2cc(NC(=O)c3cc(CN4CCN(C)CC4)cc(c3)C(F)(F)F)ccc12)c1cncnc1
: