Target
Discoidin domain-containing receptor 2
Ligand
BDBM410057
Substrate
Meas. Tech.
Lantha Screen Eu Kinase Activity Assay
IC50
1100±n/a nM
Citation
 Brekken, RADing, KRen, XTu, ZWang, ZAguilera, KY Small-molecule inhibitors targeting discoidin domain receptor 1 and uses thereof US Patent  US10370360 Publication Date 8/6/2019 
Target
Name:
Discoidin domain-containing receptor 2
Synonyms:
DDR2 Discoidin domain receptor 2 (DDR2) Discoidin domain-containing receptor 2 (DDR2) NTRKR3 TYRO10
Type:
Protein
Mol. Mass.:
96717.07
Organism:
Homo sapiens (Human)
Description:
Q16832
Residue:
855
  
Inhibitor
Name:
BDBM410057
Synonyms:
D2274 | US10370360, Example 9
Type:
Small organic molecule
Emp. Form.:
C29H33F3N6O
Mol. Mass.:
538.6071
SMILES:
CC1CN(Cc2cc(ccc12)C(=O)Nc1cc(CN2CCN(C)CC2)c(C)c(c1)C(F)(F)F)c1cncnc1
: