Target
Mast/stem cell growth factor receptor Kit
Ligand
BDBM410059
Substrate
Meas. Tech.
Lantha Screen Eu Kinase Activity Assay
IC50
>10000±n/a nM
Citation
 Brekken, RADing, KRen, XTu, ZWang, ZAguilera, KY Small-molecule inhibitors targeting discoidin domain receptor 1 and uses thereof US Patent  US10370360 Publication Date 8/6/2019 
Target
Name:
Mast/stem cell growth factor receptor Kit
Synonyms:
CD117 antigen KIT Mast/stem cell growth factor receptor Kit (cKIT) Proto-oncogene tyrosine-protein kinase Kit Stem cell growth factor receptor Tyrosine-protein kinase Kit c-kit v-kit Hardy-Zuckerman 4 feline sarcoma viral oncogene homolog
Type:
Protein
Mol. Mass.:
109869.37
Organism:
Homo sapiens (Human)
Description:
P10721
Residue:
976
  
Inhibitor
Name:
BDBM410059
Synonyms:
D2188 | US10370360, Example 11
Type:
Small organic molecule
Emp. Form.:
C27H29F3N6O
Mol. Mass.:
510.554
SMILES:
CC1CN(Cc2cc(ccc12)C(=O)Nc1cc(cc(c1)C(F)(F)F)N1CCN(C)CC1)c1cncnc1
: