Target
Epithelial discoidin domain-containing receptor 1
Ligand
BDBM410065
Substrate
Meas. Tech.
Lantha Screen Eu Kinase Activity Assay
IC50
39.1±n/a nM
Citation
 Brekken, RADing, KRen, XTu, ZWang, ZAguilera, KY Small-molecule inhibitors targeting discoidin domain receptor 1 and uses thereof US Patent  US10370360 Publication Date 8/6/2019 
Target
Name:
Epithelial discoidin domain-containing receptor 1
Synonyms:
CAK DDR1_HUMAN Discoidin domain-containing receptor 1 (DDR1) EDDR1 Epithelial discoidin domain receptor 1 (DDR1) Epithelial discoidin domain-containing receptor 1 (DDR1) Mammary carcinoma kinase 10 NTRK4 Protein-tyrosine kinase RTK 6 TRKE | Tyrosine-protein kinase CAK
Type:
Tyrosine-protein kinase
Mol. Mass.:
101130.02
Organism:
Homo sapiens (Human)
Description:
Q08345
Residue:
913
  
Inhibitor
Name:
BDBM410065
Synonyms:
D2275 | US10370360, Example 17
Type:
Small organic molecule
Emp. Form.:
C29H33F3N6O
Mol. Mass.:
538.6071
SMILES:
CCN1CCN(Cc2cc(NC(=O)c3ccc4C(C)CN(Cc4c3)c3cncnc3)cc(c2)C(F)(F)F)CC1
: