Target
Epithelial discoidin domain-containing receptor 1
Ligand
BDBM410076
Substrate
Meas. Tech.
Lantha Screen Eu Kinase Activity Assay
IC50
66.6±n/a nM
Citation
 Brekken, RADing, KRen, XTu, ZWang, ZAguilera, KY Small-molecule inhibitors targeting discoidin domain receptor 1 and uses thereof US Patent  US10370360 Publication Date 8/6/2019 
Target
Name:
Epithelial discoidin domain-containing receptor 1
Synonyms:
CAK DDR1_HUMAN Discoidin domain-containing receptor 1 (DDR1) EDDR1 Epithelial discoidin domain receptor 1 (DDR1) Epithelial discoidin domain-containing receptor 1 (DDR1) Mammary carcinoma kinase 10 NTRK4 Protein-tyrosine kinase RTK 6 TRKE | Tyrosine-protein kinase CAK
Type:
Tyrosine-protein kinase
Mol. Mass.:
101130.02
Organism:
Homo sapiens (Human)
Description:
Q08345
Residue:
913
  
Inhibitor
Name:
BDBM410076
Synonyms:
D2350 | US10370360, Example 28
Type:
Small organic molecule
Emp. Form.:
C31H40N6O
Mol. Mass.:
512.6889
SMILES:
CC1CN(Cc2cc(ccc12)C(=O)Nc1cc(CN2CCN(C)CC2)cc(c1)C(C)(C)C)c1cncnc1
: