Target
Discoidin domain-containing receptor 2
Ligand
BDBM410077
Substrate
Meas. Tech.
Lantha Screen Eu Kinase Activity Assay
IC50
1400±n/a nM
Citation
 Brekken, RADing, KRen, XTu, ZWang, ZAguilera, KY Small-molecule inhibitors targeting discoidin domain receptor 1 and uses thereof US Patent  US10370360 Publication Date 8/6/2019 
Target
Name:
Discoidin domain-containing receptor 2
Synonyms:
DDR2 Discoidin domain receptor 2 (DDR2) Discoidin domain-containing receptor 2 (DDR2) NTRKR3 TYRO10
Type:
Protein
Mol. Mass.:
96717.07
Organism:
Homo sapiens (Human)
Description:
Q16832
Residue:
855
  
Inhibitor
Name:
BDBM410077
Synonyms:
D2476 | US10370360, Example 29
Type:
Small organic molecule
Emp. Form.:
C33H36N6O
Mol. Mass.:
532.6785
SMILES:
CC1CN(Cc2cc(ccc12)C(=O)Nc1cc(CN2CCN(C)CC2)cc(c1)-c1ccccc1)c1cncnc1
: