Target
Tyrosine-protein kinase JAK3 [811-1124]
Ligand
BDBM410155
Substrate
Meas. Tech.
Caliper mobility shift assay
IC50
>10000±n/a nM
Citation
 Gauvry, NTahtaoui, CFuret, PDucray, P Heterocyclyl-substituted cyclohexylsulfonamides as JAK inhibitors US Patent  US10370375 Publication Date 8/6/2019 
Target
Name:
Tyrosine-protein kinase JAK3 [811-1124]
Synonyms:
JAK3 JAK3_HUMAN | Tyrosine-protein kinase JAK3 (aa 811-1124)
Type:
Protein
Mol. Mass.:
35601.85
Organism:
Homo sapiens (Human)
Description:
P52333[811-1124]
Residue:
314
  
Inhibitor
Name:
BDBM410155
Synonyms:
US10370375, Example 3
Type:
Small organic molecule
Emp. Form.:
C13H21N7O2S
Mol. Mass.:
339.417
SMILES:
CNS(=O)(=O)C[C@H]1CCC(CC1)N(C)c1ncnc2[nH]nnc12
: